﻿"Item Id","Item URI","Dublin Core:Title","Dublin Core:Alternative Title","Dublin Core:Description","Dublin Core:Creator","Dublin Core:Contributor","Dublin Core:Spatial Coverage","Dublin Core:Temporal Coverage","Dublin Core:Coverage","Dublin Core:Date","Dublin Core:Date Created","Dublin Core:Language","Dublin Core:Type","Dublin Core:Format","Dublin Core:Medium","Dublin Core:Extent","Dublin Core:Source","Dublin Core:Subject","Dublin Core:Is Part Of","Dublin Core:Relation","Dublin Core:Publisher","Dublin Core:Bibliographic Citation","Dublin Core:Identifier","Dublin Core:Rights","Dublin Core:Rights Holder","Dublin Core:Abstract","Dublin Core:Table Of Contents","Dublin Core:Date Available","Dublin Core:Date Accepted","Dublin Core:Date Copyrighted","Dublin Core:Date Submitted","Dublin Core:Date Issued","Dublin Core:Date Modified","Dublin Core:Date Valid","Dublin Core:Access Rights","Dublin Core:License","Dublin Core:Conforms To","Dublin Core:Has Format","Dublin Core:Has Part","Dublin Core:Has Version","Dublin Core:Is Format Of","Dublin Core:Is Referenced By","Dublin Core:Is Replaced By","Dublin Core:Is Required By","Dublin Core:Is Version Of","Dublin Core:References","Dublin Core:Replaces","Dublin Core:Requires","Dublin Core:Accrual Method","Dublin Core:Accrual Periodicity","Dublin Core:Accrual Policy","Dublin Core:Audience","Dublin Core:Audience Education Level","Dublin Core:Mediator","Dublin Core:Instructional Method","Dublin Core:Provenance","Item Type Metadata:Text","Item Type Metadata:Interviewer","Item Type Metadata:Interviewee","Item Type Metadata:Location","Item Type Metadata:Transcription","Item Type Metadata:Local URL","Item Type Metadata:Original Format","Item Type Metadata:Physical Dimensions","Item Type Metadata:Duration","Item Type Metadata:Compression","Item Type Metadata:Producer","Item Type Metadata:Director","Item Type Metadata:Bit Rate/Frequency","Item Type Metadata:Time Summary","Item Type Metadata:Email Body","Item Type Metadata:Subject Line","Item Type Metadata:From","Item Type Metadata:To","Item Type Metadata:CC","Item Type Metadata:BCC","Item Type Metadata:Number of Attachments","Item Type Metadata:Standards","Item Type Metadata:Objectives","Item Type Metadata:Materials","Item Type Metadata:Lesson Plan Text","Item Type Metadata:URL","Item Type Metadata:Event Type","Item Type Metadata:Participants","Item Type Metadata:Birth Date","Item Type Metadata:Birthplace","Item Type Metadata:Death Date","Item Type Metadata:Occupation","Item Type Metadata:Biographical Text","Item Type Metadata:Bibliography","PDF Text:Text",tags,file,itemType,collection,public,featured
5163,https://mediateka.ek.szte.hu/items/show/5163,"3. album, 52. oldal",,,"Shvoy Kálmán","Pándi Lajos (adományozó)",Kitzbuhel,,,,1926,,,,oldalkép,"35x26 cm (3264x2423 px)","<a href=""https://qulto.bibl.u-szeged.hu:443/hu/record/-/record/bibJAT01162892"">Shvoy Kálmán fotóalbumai : 3. album</a><br />leltári szám: XKEP 3",,"3. album (Shvoy Kálmán)",,,"p. 52.",shvoy-003-052-000,"Creative Commons CC BY-NC-SA 2.5 HU","SZTE Klebelsberg Könyvtár",,,,,,,,,,,,,,,,,,,,,,,,,,,,,,,,,,,,,,,,,,,,,,,,,,,,,,,,,,,,,,,,,,,,http://digit.bibl.u-szeged.hu/shvoy/3.album/52.oldal/0.jpeg,"Still Image","Shvoy Kálmán - 03. album",1,0
5169,https://mediateka.ek.szte.hu/items/show/5169,"3. album, 53. oldal",,,"Shvoy Kálmán","Pándi Lajos (adományozó)",Kitzbuhel,,,,1928,,,,oldalkép,"35x26 cm (3171x2352 px)","<a href=""https://qulto.bibl.u-szeged.hu:443/hu/record/-/record/bibJAT01162892"">Shvoy Kálmán fotóalbumai : 3. album</a><br />leltári szám: XKEP 3",,"3. album (Shvoy Kálmán)",,,"p. 53.",shvoy-003-053-000,"Creative Commons CC BY-NC-SA 2.5 HU","SZTE Klebelsberg Könyvtár",,,,,,,,,,,,,,,,,,,,,,,,,,,,,,,,,,,,,,,,,,,,,,,,,,,,,,,,,,,,,,,,,,,,http://digit.bibl.u-szeged.hu/shvoy/3.album/53.oldal/0.jpeg,"Still Image","Shvoy Kálmán - 03. album",1,0
5178,https://mediateka.ek.szte.hu/items/show/5178,"3. album, 54. oldal",,,"Shvoy Kálmán","Pándi Lajos (adományozó)","Krimml; Kitzbuhel",,,,1928,,,,oldalkép,"35x26 cm (3100x2465 px)","<a href=""https://qulto.bibl.u-szeged.hu:443/hu/record/-/record/bibJAT01162892"">Shvoy Kálmán fotóalbumai : 3. album</a><br />leltári szám: XKEP 3",,"3. album (Shvoy Kálmán)",,,"p. 54.",shvoy-003-054-000,"Creative Commons CC BY-NC-SA 2.5 HU","SZTE Klebelsberg Könyvtár",,,,,,,,,,,,,,,,,,,,,,,,,,,,,,,,,,,,,,,,,,,,,,,,,,,,,,,,,,,,,,,,,,,,http://digit.bibl.u-szeged.hu/shvoy/3.album/54.oldal/0.jpeg,"Still Image","Shvoy Kálmán - 03. album",1,0
5188,https://mediateka.ek.szte.hu/items/show/5188,"3. album, 55. oldal",,,"Shvoy Kálmán","Pándi Lajos (adományozó)","Zell am See",,,,1928,,,,oldalkép,"35x26 cm (3103x2353 px)","<a href=""https://qulto.bibl.u-szeged.hu:443/hu/record/-/record/bibJAT01162892"">Shvoy Kálmán fotóalbumai : 3. album</a><br />leltári szám: XKEP 3",,"3. album (Shvoy Kálmán)",,,"p. 55.",shvoy-003-055-000,"Creative Commons CC BY-NC-SA 2.5 HU","SZTE Klebelsberg Könyvtár",,,,,,,,,,,,,,,,,,,,,,,,,,,,,,,,,,,,,,,,,,,,,,,,,,,,,,,,,,,,,,,,,,,,http://digit.bibl.u-szeged.hu/shvoy/3.album/55.oldal/0.jpeg,"Still Image","Shvoy Kálmán - 03. album",1,0
5196,https://mediateka.ek.szte.hu/items/show/5196,"3. album, 56. oldal",,,"Shvoy Kálmán","Pándi Lajos (adományozó)",Werfen,,,,1928,,,,oldalkép,"35x26 cm (3107x2233 px)","<a href=""https://qulto.bibl.u-szeged.hu:443/hu/record/-/record/bibJAT01162892"">Shvoy Kálmán fotóalbumai : 3. album</a><br />leltári szám: XKEP 3",,"3. album (Shvoy Kálmán)",,,"p. 56.",shvoy-003-056-000,"Creative Commons CC BY-NC-SA 2.5 HU","SZTE Klebelsberg Könyvtár",,,,,,,,,,,,,,,,,,,,,,,,,,,,,,,,,,,,,,,,,,,,,,,,,,,,,,,,,,,,,,,,,,,,http://digit.bibl.u-szeged.hu/shvoy/3.album/56.oldal/0.jpeg,"Still Image","Shvoy Kálmán - 03. album",1,0
5201,https://mediateka.ek.szte.hu/items/show/5201,"3. album, 57. oldal",,,"Shvoy Kálmán","Pándi Lajos (adományozó)",,,,,1928,,,,oldalkép,"35x26 cm (3372x2206 px)","<a href=""https://qulto.bibl.u-szeged.hu:443/hu/record/-/record/bibJAT01162892"">Shvoy Kálmán fotóalbumai : 3. album</a><br />leltári szám: XKEP 3",,"3. album (Shvoy Kálmán)",,,"p. 57.",shvoy-003-057-000,"Creative Commons CC BY-NC-SA 2.5 HU","SZTE Klebelsberg Könyvtár",,,,,,,,,,,,,,,,,,,,,,,,,,,,,,,,,,,,,,,,,,,,,,,,,,,,,,,,,,,,,,,,,,,,http://digit.bibl.u-szeged.hu/shvoy/3.album/57.oldal/0.jpeg,"Still Image","Shvoy Kálmán - 03. album",1,0
5206,https://mediateka.ek.szte.hu/items/show/5206,"3. album, 58. oldal",,,"Shvoy Kálmán","Pándi Lajos (adományozó)",Salzburg,,,,1928,,,,oldalkép,"35x26 cm (2890x2289 px)","<a href=""https://qulto.bibl.u-szeged.hu:443/hu/record/-/record/bibJAT01162892"">Shvoy Kálmán fotóalbumai : 3. album</a><br />leltári szám: XKEP 3",,"3. album (Shvoy Kálmán)",,,"p. 58.",shvoy-003-058-000,"Creative Commons CC BY-NC-SA 2.5 HU","SZTE Klebelsberg Könyvtár",,,,,,,,,,,,,,,,,,,,,,,,,,,,,,,,,,,,,,,,,,,,,,,,,,,,,,,,,,,,,,,,,,,,http://digit.bibl.u-szeged.hu/shvoy/3.album/58.oldal/0.jpeg,"Still Image","Shvoy Kálmán - 03. album",1,0
5212,https://mediateka.ek.szte.hu/items/show/5212,"3. album, 59. oldal",,,"Shvoy Kálmán","Pándi Lajos (adományozó)",Salzburg,,,,1928,,,,oldalkép,"35x26 cm (2913x2374 px)","<a href=""https://qulto.bibl.u-szeged.hu:443/hu/record/-/record/bibJAT01162892"">Shvoy Kálmán fotóalbumai : 3. album</a><br />leltári szám: XKEP 3",,"3. album (Shvoy Kálmán)",,,"p. 59.",shvoy-003-059-000,"Creative Commons CC BY-NC-SA 2.5 HU","SZTE Klebelsberg Könyvtár",,,,,,,,,,,,,,,,,,,,,,,,,,,,,,,,,,,,,,,,,,,,,,,,,,,,,,,,,,,,,,,,,,,,http://digit.bibl.u-szeged.hu/shvoy/3.album/59.oldal/0.jpeg,"Still Image","Shvoy Kálmán - 03. album",1,0
4868,https://mediateka.ek.szte.hu/items/show/4868,"3. album, 6. oldal",,,"Shvoy Kálmán","Pándi Lajos (adományozó)",,,,,1928,,,,oldalkép,"35x26 cm (3283x2427 px)","<a href=""https://qulto.bibl.u-szeged.hu:443/hu/record/-/record/bibJAT01162892"">Shvoy Kálmán fotóalbumai : 3. album</a><br />leltári szám: XKEP 3",,"3. album (Shvoy Kálmán)",,,"p. 6.",shvoy-003-006-000,"Creative Commons CC BY-NC-SA 2.5 HU","SZTE Klebelsberg Könyvtár",,,,,,,,,,,,,,,,,,,,,,,,,,,,,,,,,,,,,,,,,,,,,,,,,,,,,,,,,,,,,,,,,,,,http://digit.bibl.u-szeged.hu/shvoy/3.album/6.oldal/0.jpeg,"Still Image","Shvoy Kálmán - 03. album",1,0
5217,https://mediateka.ek.szte.hu/items/show/5217,"3. album, 60. oldal",,,"Shvoy Kálmán","Pándi Lajos (adományozó)",Salzburg,,,,1928,,,,oldalkép,"35x26 cm (2842x2356 px)","<a href=""https://qulto.bibl.u-szeged.hu:443/hu/record/-/record/bibJAT01162892"">Shvoy Kálmán fotóalbumai : 3. album</a><br />leltári szám: XKEP 3",,"3. album (Shvoy Kálmán)",,,"p. 60.",shvoy-003-060-000,"Creative Commons CC BY-NC-SA 2.5 HU","SZTE Klebelsberg Könyvtár",,,,,,,,,,,,,,,,,,,,,,,,,,,,,,,,,,,,,,,,,,,,,,,,,,,,,,,,,,,,,,,,,,,,http://digit.bibl.u-szeged.hu/shvoy/3.album/60.oldal/0.jpeg,"Still Image","Shvoy Kálmán - 03. album",1,0
5222,https://mediateka.ek.szte.hu/items/show/5222,"3. album, 61. oldal",,,"Shvoy Kálmán","Pándi Lajos (adományozó)","Strobl; Sankt Gilgen; St. Wolfgang",,,,1928,,,,oldalkép,"35x26 cm (3141x2251 px)","<a href=""https://qulto.bibl.u-szeged.hu:443/hu/record/-/record/bibJAT01162892"">Shvoy Kálmán fotóalbumai : 3. album</a><br />leltári szám: XKEP 3",,"3. album (Shvoy Kálmán)",,,"p. 61.",shvoy-003-061-000,"Creative Commons CC BY-NC-SA 2.5 HU","SZTE Klebelsberg Könyvtár",,,,,,,,,,,,,,,,,,,,,,,,,,,,,,,,,,,,,,,,,,,,,,,,,,,,,,,,,,,,,,,,,,,,http://digit.bibl.u-szeged.hu/shvoy/3.album/61.oldal/0.jpeg,"Still Image","Shvoy Kálmán - 03. album",1,0
5227,https://mediateka.ek.szte.hu/items/show/5227,"3. album, 62. oldal",,,"Shvoy Kálmán","Pándi Lajos (adományozó)","Abersee; St. Wolfgang; Sankt Gilgen",,,,1928,,,,oldalkép,"35x26 cm (3037x2289 px)","<a href=""https://qulto.bibl.u-szeged.hu:443/hu/record/-/record/bibJAT01162892"">Shvoy Kálmán fotóalbumai : 3. album</a><br />leltári szám: XKEP 3",,"3. album (Shvoy Kálmán)",,,"p. 62.",shvoy-003-062-000,"Creative Commons CC BY-NC-SA 2.5 HU","SZTE Klebelsberg Könyvtár",,,,,,,,,,,,,,,,,,,,,,,,,,,,,,,,,,,,,,,,,,,,,,,,,,,,,,,,,,,,,,,,,,,,http://digit.bibl.u-szeged.hu/shvoy/3.album/62.oldal/0.jpeg,"Still Image","Shvoy Kálmán - 03. album",1,0
5232,https://mediateka.ek.szte.hu/items/show/5232,"3. album, 63. oldal",,,"Shvoy Kálmán","Pándi Lajos (adományozó)","Bad Ischl",,,,1928,,,,oldalkép,"35x26 cm (3123x2232 px)","<a href=""https://qulto.bibl.u-szeged.hu:443/hu/record/-/record/bibJAT01162892"">Shvoy Kálmán fotóalbumai : 3. album</a><br />leltári szám: XKEP 3",,"3. album (Shvoy Kálmán)",,,"p. 63.",shvoy-003-063-000,"Creative Commons CC BY-NC-SA 2.5 HU","SZTE Klebelsberg Könyvtár",,,,,,,,,,,,,,,,,,,,,,,,,,,,,,,,,,,,,,,,,,,,,,,,,,,,,,,,,,,,,,,,,,,,http://digit.bibl.u-szeged.hu/shvoy/3.album/63.oldal/0.jpeg,"Still Image","Shvoy Kálmán - 03. album",1,0
5239,https://mediateka.ek.szte.hu/items/show/5239,"3. album, 64. oldal",,,"Shvoy Kálmán","Pándi Lajos (adományozó)","Bad Ischl",,,,1928,,,,oldalkép,"35x26 cm (3115x2289 px)","<a href=""https://qulto.bibl.u-szeged.hu:443/hu/record/-/record/bibJAT01162892"">Shvoy Kálmán fotóalbumai : 3. album</a><br />leltári szám: XKEP 3",,"3. album (Shvoy Kálmán)",,,"p. 64.",shvoy-003-064-000,"Creative Commons CC BY-NC-SA 2.5 HU","SZTE Klebelsberg Könyvtár",,,,,,,,,,,,,,,,,,,,,,,,,,,,,,,,,,,,,,,,,,,,,,,,,,,,,,,,,,,,,,,,,,,,http://digit.bibl.u-szeged.hu/shvoy/3.album/64.oldal/0.jpeg,"Still Image","Shvoy Kálmán - 03. album",1,0
5246,https://mediateka.ek.szte.hu/items/show/5246,"3. album, 65. oldal",,,"Shvoy Kálmán","Pándi Lajos (adományozó)","Bad Ischl",,,,1928,,,,oldalkép,"35x26 cm (3092x2259 px)","<a href=""https://qulto.bibl.u-szeged.hu:443/hu/record/-/record/bibJAT01162892"">Shvoy Kálmán fotóalbumai : 3. album</a><br />leltári szám: XKEP 3",,"3. album (Shvoy Kálmán)",,,"p. 65.",shvoy-003-065-000,"Creative Commons CC BY-NC-SA 2.5 HU","SZTE Klebelsberg Könyvtár",,,,,,,,,,,,,,,,,,,,,,,,,,,,,,,,,,,,,,,,,,,,,,,,,,,,,,,,,,,,,,,,,,,,http://digit.bibl.u-szeged.hu/shvoy/3.album/65.oldal/0.jpeg,"Still Image","Shvoy Kálmán - 03. album",1,0
5251,https://mediateka.ek.szte.hu/items/show/5251,"3. album, 66. oldal",,,"Shvoy Kálmán","Pándi Lajos (adományozó)","Bad Aussee",,,,1928,,,,oldalkép,"35x26 cm (3122x2416 px)","<a href=""https://qulto.bibl.u-szeged.hu:443/hu/record/-/record/bibJAT01162892"">Shvoy Kálmán fotóalbumai : 3. album</a><br />leltári szám: XKEP 3",,"3. album (Shvoy Kálmán)",,,"p. 66.",shvoy-003-066-000,"Creative Commons CC BY-NC-SA 2.5 HU","SZTE Klebelsberg Könyvtár",,,,,,,,,,,,,,,,,,,,,,,,,,,,,,,,,,,,,,,,,,,,,,,,,,,,,,,,,,,,,,,,,,,,http://digit.bibl.u-szeged.hu/shvoy/3.album/66.oldal/0.jpeg,"Still Image","Shvoy Kálmán - 03. album",1,0
5256,https://mediateka.ek.szte.hu/items/show/5256,"3. album, 67. oldal",,,"Shvoy Kálmán","Pándi Lajos (adományozó)","Bad Aussee",,,,1928,,,,oldalkép,"35x26 cm (2857x2378 px)","<a href=""https://qulto.bibl.u-szeged.hu:443/hu/record/-/record/bibJAT01162892"">Shvoy Kálmán fotóalbumai : 3. album</a><br />leltári szám: XKEP 3",,"3. album (Shvoy Kálmán)",,,"p. 67.",shvoy-003-067-000,"Creative Commons CC BY-NC-SA 2.5 HU","SZTE Klebelsberg Könyvtár",,,,,,,,,,,,,,,,,,,,,,,,,,,,,,,,,,,,,,,,,,,,,,,,,,,,,,,,,,,,,,,,,,,,http://digit.bibl.u-szeged.hu/shvoy/3.album/67.oldal/0.jpeg,"Still Image","Shvoy Kálmán - 03. album",1,0
5261,https://mediateka.ek.szte.hu/items/show/5261,"3. album, 68. oldal",,,"Shvoy Kálmán","Pándi Lajos (adományozó)",Grundlsee,,,,1928,,,,oldalkép,"35x26 cm (3466x2444 px)","<a href=""https://qulto.bibl.u-szeged.hu:443/hu/record/-/record/bibJAT01162892"">Shvoy Kálmán fotóalbumai : 3. album</a><br />leltári szám: XKEP 3",,"3. album (Shvoy Kálmán)",,,"p. 68.",shvoy-003-068-000,"Creative Commons CC BY-NC-SA 2.5 HU","SZTE Klebelsberg Könyvtár",,,,,,,,,,,,,,,,,,,,,,,,,,,,,,,,,,,,,,,,,,,,,,,,,,,,,,,,,,,,,,,,,,,,http://digit.bibl.u-szeged.hu/shvoy/3.album/68.oldal/0.jpeg,"Still Image","Shvoy Kálmán - 03. album",1,0
5266,https://mediateka.ek.szte.hu/items/show/5266,"3. album, 69. oldal",,,"Shvoy Kálmán","Pándi Lajos (adományozó)",Admont,,,,1928,,,,oldalkép,"35x26 cm (3339x2419 px)","<a href=""https://qulto.bibl.u-szeged.hu:443/hu/record/-/record/bibJAT01162892"">Shvoy Kálmán fotóalbumai : 3. album</a><br />leltári szám: XKEP 3",,"3. album (Shvoy Kálmán)",,,"p. 69.",shvoy-003-069-000,"Creative Commons CC BY-NC-SA 2.5 HU","SZTE Klebelsberg Könyvtár",,,,,,,,,,,,,,,,,,,,,,,,,,,,,,,,,,,,,,,,,,,,,,,,,,,,,,,,,,,,,,,,,,,,http://digit.bibl.u-szeged.hu/shvoy/3.album/69.oldal/0.jpeg,"Still Image","Shvoy Kálmán - 03. album",1,0
4873,https://mediateka.ek.szte.hu/items/show/4873,"3. album, 7. oldal",,,"Shvoy Kálmán","Pándi Lajos (adományozó)",[Friedrichshafen],,,,1928,,,,oldalkép,"35x26 cm (3320x2473 px)","<a href=""https://qulto.bibl.u-szeged.hu:443/hu/record/-/record/bibJAT01162892"">Shvoy Kálmán fotóalbumai : 3. album</a><br />leltári szám: XKEP 3","Zeppelin, Ferdinand von","3. album (Shvoy Kálmán)",,,"p. 7.",shvoy-003-007-000,"Creative Commons CC BY-NC-SA 2.5 HU","SZTE Klebelsberg Könyvtár",,,,,,,,,,,,,,,,,,,,,,,,,,,,,,,,,,,,,,,,,,,,,,,,,,,,,,,,,,,,,,,,,,,,http://digit.bibl.u-szeged.hu/shvoy/3.album/7.oldal/0.jpeg,"Still Image","Shvoy Kálmán - 03. album",1,0
5271,https://mediateka.ek.szte.hu/items/show/5271,"3. album, 70. oldal",,,"Shvoy Kálmán","Pándi Lajos (adományozó)",Mariazell,,,,1928,,,,oldalkép,"35x26 cm (3525x2448 px)","<a href=""https://qulto.bibl.u-szeged.hu:443/hu/record/-/record/bibJAT01162892"">Shvoy Kálmán fotóalbumai : 3. album</a><br />leltári szám: XKEP 3",,"3. album (Shvoy Kálmán)",,,"p. 70.",shvoy-003-070-000,"Creative Commons CC BY-NC-SA 2.5 HU","SZTE Klebelsberg Könyvtár",,,,,,,,,,,,,,,,,,,,,,,,,,,,,,,,,,,,,,,,,,,,,,,,,,,,,,,,,,,,,,,,,,,,http://digit.bibl.u-szeged.hu/shvoy/3.album/70.oldal/0.jpeg,"Still Image","Shvoy Kálmán - 03. album",1,0
5276,https://mediateka.ek.szte.hu/items/show/5276,"3. album, 71. oldal",,,"Shvoy Kálmán","Pándi Lajos (adományozó)","Mariazell; Bécs",,,,1928,,,,oldalkép,"35x26 cm (3343x2500 px)","<a href=""https://qulto.bibl.u-szeged.hu:443/hu/record/-/record/bibJAT01162892"">Shvoy Kálmán fotóalbumai : 3. album</a><br />leltári szám: XKEP 3",,"3. album (Shvoy Kálmán)",,,"p. 71.",shvoy-003-071-000,"Creative Commons CC BY-NC-SA 2.5 HU","SZTE Klebelsberg Könyvtár",,,,,,,,,,,,,,,,,,,,,,,,,,,,,,,,,,,,,,,,,,,,,,,,,,,,,,,,,,,,,,,,,,,,http://digit.bibl.u-szeged.hu/shvoy/3.album/71.oldal/0.jpeg,"Still Image","Shvoy Kálmán - 03. album",1,0
5281,https://mediateka.ek.szte.hu/items/show/5281,"3. album, 72. oldal",,,"Shvoy Kálmán","Pándi Lajos (adományozó)",Bécs,,,,1928,,,,oldalkép,"35x26 cm (3281x2389 px)","<a href=""https://qulto.bibl.u-szeged.hu:443/hu/record/-/record/bibJAT01162892"">Shvoy Kálmán fotóalbumai : 3. album</a><br />leltári szám: XKEP 3",,"3. album (Shvoy Kálmán)",,,"p. 72.",shvoy-003-072-000,"Creative Commons CC BY-NC-SA 2.5 HU","SZTE Klebelsberg Könyvtár",,,,,,,,,,,,,,,,,,,,,,,,,,,,,,,,,,,,,,,,,,,,,,,,,,,,,,,,,,,,,,,,,,,,http://digit.bibl.u-szeged.hu/shvoy/3.album/72.oldal/0.jpeg,"Still Image","Shvoy Kálmán - 03. album",1,0
5284,https://mediateka.ek.szte.hu/items/show/5284,"3. album, 73. oldal",,,"Shvoy Kálmán","Pándi Lajos (adományozó)",,,,,,,,,oldalkép,"35x26 cm (3229x2511 px)","<a href=""https://qulto.bibl.u-szeged.hu:443/hu/record/-/record/bibJAT01162892"">Shvoy Kálmán fotóalbumai : 3. album</a><br />leltári szám: XKEP 3",,"3. album (Shvoy Kálmán)",,,"p. 73.",shvoy-003-073-000,"Creative Commons CC BY-NC-SA 2.5 HU","SZTE Klebelsberg Könyvtár",,,,,,,,,,,,,,,,,,,,,,,,,,,,,,,,,,,,,,,,,,,,,,,,,,,,,,,,,,,,,,,,,,,,http://digit.bibl.u-szeged.hu/shvoy/3.album/73.oldal/0.jpeg,"Still Image","Shvoy Kálmán - 03. album",1,0
5288,https://mediateka.ek.szte.hu/items/show/5288,"3. album, 74. oldal",,,"Shvoy Kálmán","Pándi Lajos (adományozó)","Bingen am Rhein",,,,1928,,,,oldalkép,"35x26 cm (3437x2537 px)","<a href=""https://qulto.bibl.u-szeged.hu:443/hu/record/-/record/bibJAT01162892"">Shvoy Kálmán fotóalbumai : 3. album</a><br />leltári szám: XKEP 3",,"3. album (Shvoy Kálmán)",,,"p. 74.",shvoy-003-074-000,"Creative Commons CC BY-NC-SA 2.5 HU","SZTE Klebelsberg Könyvtár",,,,,,,,,,,,,,,,,,,,,,,,,,,,,,,,,,,,,,,,,,,,,,,,,,,,,,,,,,,,,,,,,,,,http://digit.bibl.u-szeged.hu/shvoy/3.album/74.oldal/0.jpeg,"Still Image","Shvoy Kálmán - 03. album",1,0
5292,https://mediateka.ek.szte.hu/items/show/5292,"3. album, 75. oldal",,,"Shvoy Kálmán","Pándi Lajos (adományozó)","Assmanshausen; Bacharach",,,,1928,,,,oldalkép,"35x26 cm (3386x2608 px)","<a href=""https://qulto.bibl.u-szeged.hu:443/hu/record/-/record/bibJAT01162892"">Shvoy Kálmán fotóalbumai : 3. album</a><br />leltári szám: XKEP 3",,"3. album (Shvoy Kálmán)",,,"p. 75.",shvoy-003-075-000,"Creative Commons CC BY-NC-SA 2.5 HU","SZTE Klebelsberg Könyvtár",,,,,,,,,,,,,,,,,,,,,,,,,,,,,,,,,,,,,,,,,,,,,,,,,,,,,,,,,,,,,,,,,,,,http://digit.bibl.u-szeged.hu/shvoy/3.album/75.oldal/0.jpeg,"Still Image","Shvoy Kálmán - 03. album",1,0
5296,https://mediateka.ek.szte.hu/items/show/5296,"3. album, 76. oldal",,,"Shvoy Kálmán","Pándi Lajos (adományozó)",Boppard,,,,1928,,,,oldalkép,"35x26 cm (3382x2492 px)","<a href=""https://qulto.bibl.u-szeged.hu:443/hu/record/-/record/bibJAT01162892"">Shvoy Kálmán fotóalbumai : 3. album</a><br />leltári szám: XKEP 3",,"3. album (Shvoy Kálmán)",,,"p. 76.",shvoy-003-076-000,"Creative Commons CC BY-NC-SA 2.5 HU","SZTE Klebelsberg Könyvtár",,,,,,,,,,,,,,,,,,,,,,,,,,,,,,,,,,,,,,,,,,,,,,,,,,,,,,,,,,,,,,,,,,,,http://digit.bibl.u-szeged.hu/shvoy/3.album/76.oldal/0.jpeg,"Still Image","Shvoy Kálmán - 03. album",1,0
5301,https://mediateka.ek.szte.hu/items/show/5301,"3. album, 77. oldal",,,"Shvoy Kálmán","Pándi Lajos (adományozó)","Braubach; Koblenz",,,,1928,,,,oldalkép,"35x26 cm (3175x2424 px)","<a href=""https://qulto.bibl.u-szeged.hu:443/hu/record/-/record/bibJAT01162892"">Shvoy Kálmán fotóalbumai : 3. album</a><br />leltári szám: XKEP 3",,"3. album (Shvoy Kálmán)",,,"p. 77.",shvoy-003-077-000,"Creative Commons CC BY-NC-SA 2.5 HU","SZTE Klebelsberg Könyvtár",,,,,,,,,,,,,,,,,,,,,,,,,,,,,,,,,,,,,,,,,,,,,,,,,,,,,,,,,,,,,,,,,,,,http://digit.bibl.u-szeged.hu/shvoy/3.album/77.oldal/0.jpeg,"Still Image","Shvoy Kálmán - 03. album",1,0
5306,https://mediateka.ek.szte.hu/items/show/5306,"3. album, 78. oldal",,,"Shvoy Kálmán","Pándi Lajos (adományozó)","Bonn; Köln",,,,1928,,,,oldalkép,"35x26 cm (3454x2524 px)","<a href=""https://qulto.bibl.u-szeged.hu:443/hu/record/-/record/bibJAT01162892"">Shvoy Kálmán fotóalbumai : 3. album</a><br />leltári szám: XKEP 3",,"3. album (Shvoy Kálmán)",,,"p. 78.",shvoy-003-078-000,"Creative Commons CC BY-NC-SA 2.5 HU","SZTE Klebelsberg Könyvtár",,,,,,,,,,,,,,,,,,,,,,,,,,,,,,,,,,,,,,,,,,,,,,,,,,,,,,,,,,,,,,,,,,,,http://digit.bibl.u-szeged.hu/shvoy/3.album/78.oldal/0.jpeg,"Still Image","Shvoy Kálmán - 03. album",1,0
5310,https://mediateka.ek.szte.hu/items/show/5310,"3. album, 79. oldal",,,"Shvoy Kálmán","Pándi Lajos (adományozó)","Schladming; Radstadt; Millstatt; Tamsweg",,,,1928,,,,oldalkép,"35x26 cm (3213x2436 px)","<a href=""https://qulto.bibl.u-szeged.hu:443/hu/record/-/record/bibJAT01162892"">Shvoy Kálmán fotóalbumai : 3. album</a><br />leltári szám: XKEP 3",,"3. album (Shvoy Kálmán)",,,"p. 79.",shvoy-003-079-000,"Creative Commons CC BY-NC-SA 2.5 HU","SZTE Klebelsberg Könyvtár",,,,,,,,,,,,,,,,,,,,,,,,,,,,,,,,,,,,,,,,,,,,,,,,,,,,,,,,,,,,,,,,,,,,http://digit.bibl.u-szeged.hu/shvoy/3.album/79.oldal/0.jpeg,"Still Image","Shvoy Kálmán - 03. album",1,0
4878,https://mediateka.ek.szte.hu/items/show/4878,"3. album, 8. oldal",,,"Shvoy Kálmán","Pándi Lajos (adományozó)",,,,,1928,,,,oldalkép,"35x26 cm (3337x2444 px)","<a href=""https://qulto.bibl.u-szeged.hu:443/hu/record/-/record/bibJAT01162892"">Shvoy Kálmán fotóalbumai : 3. album</a><br />leltári szám: XKEP 3",,"3. album (Shvoy Kálmán)",,,"p. 8.",shvoy-003-008-000,"Creative Commons CC BY-NC-SA 2.5 HU","SZTE Klebelsberg Könyvtár",,,,,,,,,,,,,,,,,,,,,,,,,,,,,,,,,,,,,,,,,,,,,,,,,,,,,,,,,,,,,,,,,,,,http://digit.bibl.u-szeged.hu/shvoy/3.album/8.oldal/0.jpeg,"Still Image","Shvoy Kálmán - 03. album",1,0
5315,https://mediateka.ek.szte.hu/items/show/5315,"3. album, 80. oldal",,,"Shvoy Kálmán","Pándi Lajos (adományozó)","Millstatt; Heiligenblut",,,,1928,,,,oldalkép,"35x26 cm (3137x2449 px)","<a href=""https://qulto.bibl.u-szeged.hu:443/hu/record/-/record/bibJAT01162892"">Shvoy Kálmán fotóalbumai : 3. album</a><br />leltári szám: XKEP 3",,"3. album (Shvoy Kálmán)",,,"p. 80.",shvoy-003-080-000,"Creative Commons CC BY-NC-SA 2.5 HU","SZTE Klebelsberg Könyvtár",,,,,,,,,,,,,,,,,,,,,,,,,,,,,,,,,,,,,,,,,,,,,,,,,,,,,,,,,,,,,,,,,,,,http://digit.bibl.u-szeged.hu/shvoy/3.album/80.oldal/0.jpeg,"Still Image","Shvoy Kálmán - 03. album",1,0
5320,https://mediateka.ek.szte.hu/items/show/5320,"3. album, 81. oldal",,,"Shvoy Kálmán","Pándi Lajos (adományozó)",Villabassa,,,,1928,,,,oldalkép,"35x26 cm (3238x2482 px)","<a href=""https://qulto.bibl.u-szeged.hu:443/hu/record/-/record/bibJAT01162892"">Shvoy Kálmán fotóalbumai : 3. album</a><br />leltári szám: XKEP 3",,"3. album (Shvoy Kálmán)",,,"p. 81.",shvoy-003-081-000,"Creative Commons CC BY-NC-SA 2.5 HU","SZTE Klebelsberg Könyvtár",,,,,,,,,,,,,,,,,,,,,,,,,,,,,,,,,,,,,,,,,,,,,,,,,,,,,,,,,,,,,,,,,,,,http://digit.bibl.u-szeged.hu/shvoy/3.album/81.oldal/0.jpeg,"Still Image","Shvoy Kálmán - 03. album",1,0
5324,https://mediateka.ek.szte.hu/items/show/5324,"3. album, 82. oldal",,,"Shvoy Kálmán","Pándi Lajos (adományozó)",Drezda,,,,1928,,,,oldalkép,"35x26 cm (3373x2474 px)","<a href=""https://qulto.bibl.u-szeged.hu:443/hu/record/-/record/bibJAT01162892"">Shvoy Kálmán fotóalbumai : 3. album</a><br />leltári szám: XKEP 3",,"3. album (Shvoy Kálmán)",,,"p. 82.",shvoy-003-082-000,"Creative Commons CC BY-NC-SA 2.5 HU","SZTE Klebelsberg Könyvtár",,,,,,,,,,,,,,,,,,,,,,,,,,,,,,,,,,,,,,,,,,,,,,,,,,,,,,,,,,,,,,,,,,,,http://digit.bibl.u-szeged.hu/shvoy/3.album/82.oldal/0.jpeg,"Still Image","Shvoy Kálmán - 03. album",1,0