﻿"Item Id","Item URI","Dublin Core:Title","Dublin Core:Alternative Title","Dublin Core:Description","Dublin Core:Creator","Dublin Core:Contributor","Dublin Core:Spatial Coverage","Dublin Core:Temporal Coverage","Dublin Core:Coverage","Dublin Core:Date","Dublin Core:Date Created","Dublin Core:Language","Dublin Core:Type","Dublin Core:Format","Dublin Core:Medium","Dublin Core:Extent","Dublin Core:Source","Dublin Core:Subject","Dublin Core:Is Part Of","Dublin Core:Relation","Dublin Core:Publisher","Dublin Core:Bibliographic Citation","Dublin Core:Identifier","Dublin Core:Rights","Dublin Core:Rights Holder","Dublin Core:Abstract","Dublin Core:Table Of Contents","Dublin Core:Date Available","Dublin Core:Date Accepted","Dublin Core:Date Copyrighted","Dublin Core:Date Submitted","Dublin Core:Date Issued","Dublin Core:Date Modified","Dublin Core:Date Valid","Dublin Core:Access Rights","Dublin Core:License","Dublin Core:Conforms To","Dublin Core:Has Format","Dublin Core:Has Part","Dublin Core:Has Version","Dublin Core:Is Format Of","Dublin Core:Is Referenced By","Dublin Core:Is Replaced By","Dublin Core:Is Required By","Dublin Core:Is Version Of","Dublin Core:References","Dublin Core:Replaces","Dublin Core:Requires","Dublin Core:Accrual Method","Dublin Core:Accrual Periodicity","Dublin Core:Accrual Policy","Dublin Core:Audience","Dublin Core:Audience Education Level","Dublin Core:Mediator","Dublin Core:Instructional Method","Dublin Core:Provenance","Item Type Metadata:Text","Item Type Metadata:Interviewer","Item Type Metadata:Interviewee","Item Type Metadata:Location","Item Type Metadata:Transcription","Item Type Metadata:Local URL","Item Type Metadata:Original Format","Item Type Metadata:Physical Dimensions","Item Type Metadata:Duration","Item Type Metadata:Compression","Item Type Metadata:Producer","Item Type Metadata:Director","Item Type Metadata:Bit Rate/Frequency","Item Type Metadata:Time Summary","Item Type Metadata:Email Body","Item Type Metadata:Subject Line","Item Type Metadata:From","Item Type Metadata:To","Item Type Metadata:CC","Item Type Metadata:BCC","Item Type Metadata:Number of Attachments","Item Type Metadata:Standards","Item Type Metadata:Objectives","Item Type Metadata:Materials","Item Type Metadata:Lesson Plan Text","Item Type Metadata:URL","Item Type Metadata:Event Type","Item Type Metadata:Participants","Item Type Metadata:Birth Date","Item Type Metadata:Birthplace","Item Type Metadata:Death Date","Item Type Metadata:Occupation","Item Type Metadata:Biographical Text","Item Type Metadata:Bibliography","PDF Text:Text",tags,file,itemType,collection,public,featured
21815,https://mediateka.ek.szte.hu/items/show/21815,"A szegedi egyetemek rektorai fogadják a meghívott minisztereket","A szegedi egyetemi felsőoktatás megindulásának 50. évfordulója alkalmából rendezett ünnepségsorozat",,,,Szeged,,,,"1971. október 9-11.",,,fekete-fehér,fénykép,"6,5x9,5 cm",,"Szabó Zoltán egészségügyi miniszter; Ilku Pál művelődésügyi miniszter (takarásban); Tóth Károly a SZOTE rektora; Márta Ferenc a JATE rektora; Csákány Béla a JATE rektorhelyettese","Egyetemi Képgyűjtemény (A szegedi egyetemek 50. jubileumi albuma)",,,"p. 7.",szte_50_jubileum_web_009_061,"A kép a Szegedi Tudományegyetem Klebelsberg Kuno Könyvtárának tulajdonát képezi. Minden jog fenntartva.","Szegedi Tudományegyetem Klebelsberg Kuno Könyvtára",,,,,,,,,,,,,,,,,,,,,,,,,,,,,,,,,,,,,,,,,,,,,,,,,,,,,,,,,,,,,,,,,,,"Csákány Béla,Ilku Pál,Márta Ferenc,Szabó Zoltán,Tóth Károly",http://digit.bibl.u-szeged.hu/00400/00499/omeka/szte_50eves_jubileumi_album/szte_50_jubileum_web_009_061.jpg,"Still Image","Szegedi egyetemek 50. jubileuma",1,0
21822,https://mediateka.ek.szte.hu/items/show/21822,"A szegedi egyetemek rektorai fogadják a meghívott minisztereket","A szegedi egyetemi felsőoktatás megindulásának 50. évfordulója alkalmából rendezett ünnepségsorozat",,,,Szeged,,,,"1971. október 9-11.",,,fekete-fehér,fénykép,"6,5x9,5 cm",,"Szabó Zoltán egészségügyi miniszter; Ilku Pál művelődésügyi miniszter; Tóth Károly a SZOTE rektora; Márta Ferenc a JATE rektora; Csákány Béla a JATE rektorhelyettese","Egyetemi Képgyűjtemény (A szegedi egyetemek 50. jubileumi albuma)",,,"p. 8.",szte_50_jubileum_web_010_067,"A kép a Szegedi Tudományegyetem Klebelsberg Kuno Könyvtárának tulajdonát képezi. Minden jog fenntartva.","Szegedi Tudományegyetem Klebelsberg Kuno Könyvtára",,,,,,,,,,,,,,,,,,,,,,,,,,,,,,,,,,,,,,,,,,,,,,,,,,,,,,,,,,,,,,,,,,,"Csákány Béla,Ilku Pál,Márta Ferenc,Szabó Zoltán,Tóth Károly",http://digit.bibl.u-szeged.hu/00400/00499/omeka/szte_50eves_jubileumi_album/szte_50_jubileum_web_010_067.jpg,"Still Image","Szegedi egyetemek 50. jubileuma",1,0
22798,https://mediateka.ek.szte.hu/items/show/22798,"Losonci Miklós művészettörténész megnyitja Esteban Fekete kiállítását a József Attila Tudományegyetem aulájában","A József Attila Tudományegyetem aulájában megrendezett kiállítás Esteban Fekete műveiből",,,,Szeged,,,,"1988. augusztus 11.",,,színes,fénykép,"9x12 cm",,"Rektori Hivatal; Kopasz Márta; Esteban Fekete; Csákány Béla rektor; Losonci Miklós művészettörténész","Egyetemi Képgyűjtemény",,,,kiallitas_web_130,"A kép a Szegedi Tudományegyetem Klebelsberg Kuno Könyvtárának tulajdonát képezi. Minden jog fenntartva.","Szegedi Tudományegyetem Klebelsberg Kuno Könyvtára",,,,,,,,,,,,,,,,,,,,,,,,,,,,,,,,,,,,,,,,,,,,,,,,,,,,,,,,,,,,,,,,,,,"Csákány Béla,Esteban Fekete,Kopasz Márta,Losonci Miklós,Rektori Hivatal",http://digit.bibl.u-szeged.hu/00400/00499/omeka/kiallitasok/kiallitasok_vegyes/kiallitas_web_130.jpg,"Still Image","<strong>Egyetemi képgyűjtemény</strong>",1,0
22800,https://mediateka.ek.szte.hu/items/show/22800,"Losonci Miklós művészettörténész megnyitja Esteban Fekete kiállítását a József Attila Tudományegyetem aulájában","A József Attila Tudományegyetem aulájában megrendezett kiállítás Esteban Fekete műveiből",,,,Szeged,,,,"1988. augusztus 11.",,,színes,fénykép,"9x12 cm",,"Rektori Hivatal; Kopasz Márta; Esteban Fekete; Csákány Béla rektor; Losonci Miklós művészettörténész","Egyetemi Képgyűjtemény",,,,kiallitas_web_132,"A kép a Szegedi Tudományegyetem Klebelsberg Kuno Könyvtárának tulajdonát képezi. Minden jog fenntartva.","Szegedi Tudományegyetem Klebelsberg Kuno Könyvtára",,,,,,,,,,,,,,,,,,,,,,,,,,,,,,,,,,,,,,,,,,,,,,,,,,,,,,,,,,,,,,,,,,,"Csákány Béla,Esteban Fekete,Kopasz Márta,Losonci Miklós,Rektori Hivatal",http://digit.bibl.u-szeged.hu/00400/00499/omeka/kiallitasok/kiallitasok_vegyes/kiallitas_web_132.jpg,"Still Image","<strong>Egyetemi képgyűjtemény</strong>",1,0
23066,https://mediateka.ek.szte.hu/items/show/23066,"Együttműködési megállapodás aláírása a József Attila Tudományegyetem rektori dísztermében",,,,,Szeged,,,,1989,,,fekete-fehér,fénykép,"9x12 cm",,"Csákány Béla rektor; J. Nagy László egyetemi docens; Balázs Mihály egyetemi docens nevelési rektorhelyettes, Leindler László egyetemi tanár","Egyetemi Képgyűjtemény",,,,csakany_bela_web_002,"A kép a Szegedi Tudományegyetem Klebelsberg Kuno Könyvtárának tulajdonát képezi. Minden jog fenntartva.","Szegedi Tudományegyetem Klebelsberg Kuno Könyvtára",,,,,,,,,,,,,,,,,,,,,,,,,,,,,,,,,,,,,,,,,,,,,,,,,,,,,,,,,,,,,,,,,,,"Balázs Mihály,Csákány Béla,J. Nagy László,Leindler László,Rektori Hivatal","https://mediateka.ek.szte.hu/files/original/be66ca23cc4ec8331f2ba0ea6271d843.jpg,https://mediateka.ek.szte.hu/files/original/31e654493f1475d60107b481821672e7.jpg,https://mediateka.ek.szte.hu/files/original/a04bb27122d969f3c70e4491d75b6ed2.jpg,https://mediateka.ek.szte.hu/files/original/251a8500d4d583261e9060d8ea89c85c.jpg,https://mediateka.ek.szte.hu/files/original/0a3049d0016ac101b215829933809f6f.jpg,https://mediateka.ek.szte.hu/files/original/7e6dc49eade78f617b8e19c37fb52f0a.jpg,https://mediateka.ek.szte.hu/files/original/871ec3de86cae48a170fbe7ca632e186.jpg,https://mediateka.ek.szte.hu/files/original/165bd8a32a9a4abf5f9416707a736104.jpg,https://mediateka.ek.szte.hu/files/original/36e773fce14538f1717b75fb0bff9d0d.jpg","Still Image","<strong>Egyetemi képgyűjtemény</strong>",1,0
23068,https://mediateka.ek.szte.hu/items/show/23068,"Ünnepi egyetemi szenátusülés az egyetem aulájában",,,,,Szeged,,,,1985-1986,,,fekete-fehér,fénykép,"9x12 cm",,"Anderle Ádám MSZMP titkár; Papp Ignác dékán; Szalamin Edit dékánhelyettes; Csákány Béla rektor","Egyetemi Képgyűjtemény",,,,csakany_bela_web_014_01,"A kép a Szegedi Tudományegyetem Klebelsberg Kuno Könyvtárának tulajdonát képezi. Minden jog fenntartva.","Szegedi Tudományegyetem Klebelsberg Kuno Könyvtára",,,,,,,,,,,,,,,,,,,,,,,,,,,,,,,,,,,,,,,,,,,,,,,,,,,,,,,,,,,,,,,,,,,"Anderle Ádám,Csákány Béla,Papp István,Rektori Hivatal,Szalamin Edit","https://mediateka.ek.szte.hu/files/original/30b6769fc88fd84827fe8e2c7b741199.jpg,https://mediateka.ek.szte.hu/files/original/5120852239a1ee2a4514b5660e397c1d.jpg,https://mediateka.ek.szte.hu/files/original/b6319d139ae03b950d81e5e0ca8d7fdf.jpg,https://mediateka.ek.szte.hu/files/original/52d2304c5487233136a85afcf5739aaf.jpg,https://mediateka.ek.szte.hu/files/original/d04ed7930d21016c62addf94e446ed62.jpg","Still Image","<strong>Egyetemi képgyűjtemény</strong>",1,0
23071,https://mediateka.ek.szte.hu/items/show/23071,"Csákány Béla rektor elismeréseket ad át az egyetem dolgozóinak",,,,,Szeged,,,,1987-1988,,,fekete-fehér,fénykép,,,"Csákány Béla rektor","Egyetemi Képgyűjtemény",,,,csakany_bela_web_043_01,"A kép a Szegedi Tudományegyetem Klebelsberg Kuno Könyvtárának tulajdonát képezi. Minden jog fenntartva.","Szegedi Tudományegyetem Klebelsberg Kuno Könyvtár",,,,,,,,,,,,,,,,,,,,,,,,,,,,,,,,,,,,,,,,,,,,,,,,,,,,,,,,,,,,,,,,,,,"Csákány Béla,Rektori Hivatal","https://mediateka.ek.szte.hu/files/original/e17510853e58d0f1d51e7fb1c5bd8f6c.jpg,https://mediateka.ek.szte.hu/files/original/dcdf295749059d02373d860c049b7a2b.jpg,https://mediateka.ek.szte.hu/files/original/e1bc403a0ea4ba08173d30733e872d66.jpg","Still Image","<strong>Egyetemi képgyűjtemény</strong>",1,0
23072,https://mediateka.ek.szte.hu/items/show/23072,"Doktoravatás a József Attila Tudományegyetem dísztermében",,,,,Szeged,,,,1986-1987,,,fekete-fehér,fénykép,"12x18 cm",,"Első képen: Papp Ignác dékán; Csákány Béla rektor; Mikola Tibor dékán; Bartók Mihály dékán

Második képen: Csákány Béla rektor; Anderle Ádám tanszékvezető egyetemi docens; Mikola Tibor dékán; Papp Ignác dékán; Fischer Ferenc tudományos munkatárs; Varga Ilona egyetemi docens","Egyetemi Képgyűjtemény",,,,csakany_bela_web_049,"A kép a Szegedi Tudományegyetem Klebelsberg Kuno Könyvtárának tulajdonát képezi. Minden jog fenntartva.","Szegedi Tudományegyetem Klebelsberg Kuno Könyvtár",,,,,,,,,,,,,,,,,,,,,,,,,,,,,,,,,,,,,,,,,,,,,,,,,,,,,,,,,,,,,,,,,,,"Anderle Ádám,Bartók Mihály,Csákány Béla,Fischer Ferenc,Mikola Tibor,Papp Ignác,Rektori Hivatal,Varga Ilona","https://mediateka.ek.szte.hu/files/original/d3cc1074f42db47e760852191aaecd07.jpg,https://mediateka.ek.szte.hu/files/original/0096cd8656062c5112fa75ebfc7b7831.jpg,https://mediateka.ek.szte.hu/files/original/f737758d7b233194add4d4a495e1e300.jpg","Still Image","<strong>Egyetemi képgyűjtemény</strong>",1,0
23074,https://mediateka.ek.szte.hu/items/show/23074,"Doktoravató ünnepi szenátusülés",,,,,Szeged,,,,1988,,,fekete-fehér,fénykép,"9x13 cm",,"Csákány Béla rektor; J. Nagy László tanszékvezető egyetemi docens","Egyetemi Képgyűjtemény",,,,csakany_bela_web_036_01,"A kép a Szegedi Tudományegyetem Klebelsberg Kuno Könyvtárának tulajdonát képezi. Minden jog fenntartva.","Szegedi Tudományegyetem Klebelsberg Kuno Könyvtár",,,,,,,,,,,,,,,,,,,,,,,,,,,,,,,,,,,,,,,,,,,,,,,,,,,,,,,,,,,,,,,,,,,"Csákány Béla,J. Nagy László,Rektori Hivatal",https://mediateka.ek.szte.hu/files/original/2034baf4673638b64ff55b8c2617be7b.jpg,"Still Image","<strong>Egyetemi képgyűjtemény</strong>",1,0
23078,https://mediateka.ek.szte.hu/items/show/23078,"Doktoravatás a József Attila Tudományegyetemen",,,,,Szeged,,,,1986,,,színes,fénykép,"9x12,5 cm",,"Csákány Béla rektor; Makk Ferenc dékánhelyettes; Bartók Mihály dékán","Egyetemi Képgyűjtemény",,,,csakany_bela_web_038,"A kép a Szegedi Tudományegyetem Klebelsberg Kuno Könyvtárának tulajdonát képezi. Minden jog fenntartva.","Szegedi Tudományegyetem Klebelsberg Kuno Könyvtár",,,,,,,,,,,,,,,,,,,,,,,,,,,,,,,,,,,,,,,,,,,,,,,,,,,,,,,,,,,,,,,,,,,"Bartók Mihály,Csákány Béla,Makk Ferenc","https://mediateka.ek.szte.hu/files/original/d3101866c0c4f6dca8fab4510ebb5c45.jpg,https://mediateka.ek.szte.hu/files/original/7a255e9cd31bd2de60002a8ae2f0d8a9.jpg,https://mediateka.ek.szte.hu/files/original/56ad64517f016160fae6b3a9207ad816.jpg,https://mediateka.ek.szte.hu/files/original/a38accce0682105286d47b4ba3450c24.jpg,https://mediateka.ek.szte.hu/files/original/3f9ce902b1759581e134310212100f55.jpg,https://mediateka.ek.szte.hu/files/original/618ba978b49d4ea2b896fbcad0677878.jpg,https://mediateka.ek.szte.hu/files/original/c27470c208c0f09554802f3a3465d6af.jpg,https://mediateka.ek.szte.hu/files/original/6bcc1cca62c2b21c84190643f53e7091.jpg,https://mediateka.ek.szte.hu/files/original/903e9fbb8344de0ce31ef5a3676bf4dc.jpg,https://mediateka.ek.szte.hu/files/original/eb7bb58b1371885582b1b19178258565.jpg,https://mediateka.ek.szte.hu/files/original/930de5f4956cf7e21e859bb51c1f05ba.jpg","Still Image","<strong>Egyetemi képgyűjtemény</strong>",1,0
23083,https://mediateka.ek.szte.hu/items/show/23083,"November 7-i ünnepség az egyetem aulájában",,,,,Szeged,,,,"1985. november 7.",,,fekete-fehér,fénykép,"12x18 cm",,"Horuczi László; Csákány Béla rektor; Kristó Gyula prorektor","Egyetemi Képgyűjtemény",,,,kristo_gyula_web_031,"A kép a Szegedi Tudományegyetem Klebelsberg Kuno Könyvtárának tulajdonát képezi. Minden jog fenntartva.","Szegedi Tudományegyetem Klebelsberg Kuno Könyvtára",,,,,,,,,,,,,,,,,,,,,,,,,,,,,,,,,,,,,,,,,,,,,,,,,,,,,,,,,,,,,,,,,,,"Csákány Béla,Horuczi László,Kristó Gyula,Rektori Hivatal","https://mediateka.ek.szte.hu/files/original/ba516e3302388b959848fccc7240565b.jpg,https://mediateka.ek.szte.hu/files/original/113de64d90322c5a45808235aaaf6f5e.jpg,https://mediateka.ek.szte.hu/files/original/d0658e5c3579e0df0b0f2df91bb00779.jpg,https://mediateka.ek.szte.hu/files/original/3d64083cf33654b3c275a15fd948a5b9.jpg","Still Image","<strong>Egyetemi képgyűjtemény</strong>",1,0
23094,https://mediateka.ek.szte.hu/items/show/23094,"Tanévnyitó ünnepség az egyetem dísztermében",,,,,Szeged,,,,"1985. szeptember 10.",,,fekete-fehér,fénykép,"12x18 cm",,"Horuczi László szakszervezeti titkár; Andrele Ádám MSZMP titkár; Papp Ignác dékán; Csákány Béla rektor; Mikola Tibor dékán; Bartók Mihály dékán; Kozma József KISZ titkár","Egyetemi Képgyűjtemény",,,,tanevnyito_web_069,"A kép a Szegedi Tudományegyetem Klebelsberg Kuno Könyvtárának tulajdonát képezi. Minden jog fenntartva.","Szegedi Tudományegyetem Klebelsberg Kuno Könyvtára",,,,,,,,,,,,,,,,,,,,,,,,,,,,,,,,,,,,,,,,,,,,,,,,,,,,,,,,,,,,,,,,,,,"Anderle Ádám,Bartók Mihály,Csákány Béla,Horuczi László,Kozma József,Mikola Tibor,Papp Ignác,Rektori Hivatal","https://mediateka.ek.szte.hu/files/original/f5487cd3dae8d08d4b6dd7c623949130.jpg,https://mediateka.ek.szte.hu/files/original/daf969b2746c3121f11fa662291dd725.jpg,https://mediateka.ek.szte.hu/files/original/b884dbe28a115fc52cfac58338c1830f.jpg,https://mediateka.ek.szte.hu/files/original/581b13ed8de02aa938c3de5bbf7a96bc.jpg,https://mediateka.ek.szte.hu/files/original/05358161fd8a48cd16a8e319656e6f41.jpg,https://mediateka.ek.szte.hu/files/original/87ed89c79824cce219a1481089f7c9b7.jpg,https://mediateka.ek.szte.hu/files/original/294001ce9631152913c227c3e88c8666.jpg,https://mediateka.ek.szte.hu/files/original/a600129137d601aaa235de718c6576ee.jpg,https://mediateka.ek.szte.hu/files/original/d36f3c401fa4dacb0951c637d8547aef.jpg,https://mediateka.ek.szte.hu/files/original/47ccc28d3495de40a760fc00030d1a9e.jpg,https://mediateka.ek.szte.hu/files/original/cb54b14763511337139bda54b781f191.jpg,https://mediateka.ek.szte.hu/files/original/5e4fcf958f7fd00c822729721037c115.jpg","Still Image","<strong>Egyetemi képgyűjtemény</strong>",1,0
24256,https://mediateka.ek.szte.hu/items/show/24256,"Díszdoktoravató ünnepi szenátusülés a József Attila Tudományegyetemen",,,,,Szeged,,,,"1986. december 15.",,,színes,fénykép,"10x14,5 cm",,"Rektori Hivatal; Papp Ignác dékán; Csákány Béla rektor; Mikola Tibor dékán; Bartók Mihály dékán","Egyetemi Képgyűjtemény",,,,avatas_web_140,"A kép a Szegedi Tudományegyetem Klebelsberg Kuno Könyvtárának tulajdonát képezi. Minden jog fenntartva.","Szegedi Tudományegyetem Klebelsberg Kuno Könyvtára",,,,,,,,,,,,,,,,,,,,,,,,,,,,,,,,,,,,,,,,,,,,,,,,,,,,,,,,,,,,,,,,,,,"Bartók Mihály,Csákány Béla,Mikola Tibor,Papp Ignác,Rektori Hivatal",http://digit.bibl.u-szeged.hu/00400/00499/omeka/avatas/avatas_web_140.jpg,"Still Image","<strong>Egyetemi képgyűjtemény</strong>",1,0
24257,https://mediateka.ek.szte.hu/items/show/24257,"A kisgrafikai baráti kör köszönti Kopasz Mártát az egyetem aulájában rendezett kiállítása alkalmából",,,,,Szeged,,,,"1986. december 20.",,,fekete-fehér,fénykép,"12x18 cm",,"Rektori Hivatal; Csákány Béla rektor; Kopasz Márta; Herczeg Tamás; Deák Béla a Szeged városi pártbizottság titkára","Egyetemi Képgyűjtemény",,,,avatas_web_142,"A kép a Szegedi Tudományegyetem Klebelsberg Kuno Könyvtárának tulajdonát képezi. Minden jog fenntartva.","Szegedi Tudományegyetem Klebelsberg Kuno Könyvtára",,,,,,,,,,,,,,,,,,,,,,,,,,,,,,,,,,,,,,,,,,,,,,,,,,,,,,,,,,,,,,,,,,,"Csákány Béla,Deák Béla,Herczeg Tamás,Kopasz Márta,Rektori Hivatal",http://digit.bibl.u-szeged.hu/00400/00499/omeka/avatas/avatas_web_142.jpg,"Still Image","<strong>Egyetemi képgyűjtemény</strong>",1,0
24258,https://mediateka.ek.szte.hu/items/show/24258,"Csákány Béla rektor köszönti Fritz Peter Schäfer és Straub F. Brunó díszdoktori avatásán megjelent vendégeket",,,,,Szeged,,,,"1986. december 15.",,,fekete-fehér,fénykép,"12x18 cm",,"Rektori Hivatal; Papp Ignác dékán; Csákány Béla rektor; Mikola Tibor dékán; Bartók Mihály dékán","Egyetemi Képgyűjtemény",,,,avatas_web_143,"A kép a Szegedi Tudományegyetem Klebelsberg Kuno Könyvtárának tulajdonát képezi. Minden jog fenntartva.","Szegedi Tudományegyetem Klebelsberg Kuno Könyvtára",,,,,,,,,,,,,,,,,,,,,,,,,,,,,,,,,,,,,,,,,,,,,,,,,,,,,,,,,,,,,,,,,,,"Bartók Mihály,Csákány Béla,Mikola Tibor,Papp Ignác,Rektori Hivatal",http://digit.bibl.u-szeged.hu/00400/00499/omeka/avatas/avatas_web_143.jpg,"Still Image","<strong>Egyetemi képgyűjtemény</strong>",1,0
24259,https://mediateka.ek.szte.hu/items/show/24259,"Fritz Peter Schäfer átveszi a díszdoktori oklevelét Csákány Béla rektortól",,,,,Szeged,,,,"1986. december 15.",,,fekete-fehér,fénykép,"12x18 cm",,"Rektori Hivatal; Schäfer, Fritz-Peter göttingeni fizikus; Csákány Béla rektor; Mikola Tibor dékán; Bartók Mihály dékán","Egyetemi Képgyűjtemény",,,,avatas_web_144,"A kép a Szegedi Tudományegyetem Klebelsberg Kuno Könyvtárának tulajdonát képezi. Minden jog fenntartva.","Szegedi Tudományegyetem Klebelsberg Kuno Könyvtára",,,,,,,,,,,,,,,,,,,,,,,,,,,,,,,,,,,,,,,,,,,,,,,,,,,,,,,,,,,,,,,,,,,"Bartók Mihály,Csákány Béla,Fritz-Peter Schäfer,Mikola Tibor,Rektori Hivatal",http://digit.bibl.u-szeged.hu/00400/00499/omeka/avatas/avatas_web_144.jpg,"Still Image","<strong>Egyetemi képgyűjtemény</strong>",1,0
24262,https://mediateka.ek.szte.hu/items/show/24262,"Straub F. Brunó frissen avatott díszdoktor köszöntése az egyetem dísztermében",,,,,Szeged,,,,"1986. december 15.",,,fekete-fehér,fénykép,"12x18 cm",,"Rektori Hivatal; Papp Ignác dékán (takarásban); Straub F. Brunó SZBK főigazgató; Csákány Béla rektor; Mikola Tibor dékán; Bartók Mihály dékán","Egyetemi Képgyűjtemény",,,,avatas_web_154,"A kép a Szegedi Tudományegyetem Klebelsberg Kuno Könyvtárának tulajdonát képezi. Minden jog fenntartva.","Szegedi Tudományegyetem Klebelsberg Kuno Könyvtára",,,,,,,,,,,,,,,,,,,,,,,,,,,,,,,,,,,,,,,,,,,,,,,,,,,,,,,,,,,,,,,,,,,"Bartók Mihály,Csákány Béla,Mikola Tibor,Papp Ignác,Rektori Hivatal,Straub F. Brunó",http://digit.bibl.u-szeged.hu/00400/00499/omeka/avatas/avatas_web_154.jpg,"Still Image","<strong>Egyetemi képgyűjtemény</strong>",1,0
24501,https://mediateka.ek.szte.hu/items/show/24501,"A Szegedi Tudományegyetem napja ünnepség kitüntetésre váró professzorai és közönsége","A Szegedi Tudományegyetem második megrendezett ünnepnapja",,,,Szeged,,,,"2002. november 11.",,,színes,fénykép,"10x15 cm",,"Rektori Hivatal; Joel D. Kopple egyetemi tanár (Kalifornia Egyetem); Bo Lönnqvist egyetemi tanár (Jyváskylá-i Egyetem); Karl-Heinz Pfeffer egyetemi tanár (Tübingeni Egyetem); Róna-Tas András akadémikus egyetemi tanár; Bartók Mihály akadémikus egyetemi tanár; Csákány Béla nyugalmazott egyetemi tanár; Bicsérdy Gyula főiskolai tanár","Egyetemi Képgyűjtemény",,,,egyetem_napja_2002_web_007,"A kép a Szegedi Tudományegyetem Klebelsberg Kuno Könyvtárának tulajdonát képezi. Minden jog fenntartva.","Szegedi Tudományegyetem Klebelsberg Kuno Könyvtára",,,,,,,,,,,,,,,,,,,,,,,,,,,,,,,,,,,,,,,,,,,,,,,,,,,,,,,,,,,,,,,,,,,"Bartók Mihály,Bicsérdy Gyula,Bo Lönnqvist,Csákány Béla,Joel D. Kopple,Karl-Heinz Pfeffer,Rektori Hivatal,Róna-Tas András",http://digit.bibl.u-szeged.hu/00400/00499/omeka/unnepseg/egyetem_napja/egyetem_napja_2002_web_007.jpg,"Still Image","<strong>Egyetemi képgyűjtemény</strong>",1,0
24507,https://mediateka.ek.szte.hu/items/show/24507,"Csákány Béla nyugalmazott egyetemi tanár átveszi a Pro Universitate-díjat Mészáros Rezső rektortól","A Szegedi Tudományegyetem második megrendezett ünnepnapja",,,,Szeged,,,,"2002. november 11.",,,színes,fénykép,"10x15 cm",,"Rektori Hivatal; Mádl Ferenc köztársasági elnök; Mészáros Rezső rektor; Csákány Béla nyugalmazott egyetemi tanár","Egyetemi Képgyűjtemény",,,,egyetem_napja_2002_web_013,"A kép a Szegedi Tudományegyetem Klebelsberg Kuno Könyvtárának tulajdonát képezi. Minden jog fenntartva.","Szegedi Tudományegyetem Klebelsberg Kuno Könyvtára",,,,,,,,,,,,,,,,,,,,,,,,,,,,,,,,,,,,,,,,,,,,,,,,,,,,,,,,,,,,,,,,,,,"Csákány Béla,Mádl Ferenc,Mészáros Rezső,Rektori Hivatal",http://digit.bibl.u-szeged.hu/00400/00499/omeka/unnepseg/egyetem_napja/egyetem_napja_2002_web_013.jpg,"Still Image","<strong>Egyetemi képgyűjtemény</strong>",1,0
24512,https://mediateka.ek.szte.hu/items/show/24512,"Csákány Béla nyugalmazott egyetemi tanár átveszi a Professor Emeritus kitüntető címet Mészáros Rezső rektortól","A Szegedi Tudományegyetem második megrendezett ünnepnapja",,,,Szeged,,,,"2002. november 11.",,,színes,fénykép,"10x15 cm",,"Rektori Hivatal; Mádl Ferenc köztársasági elnök; Mészáros Rezső rektor; Csákány Béla nyugalmazott egyetemi tanár","Egyetemi Képgyűjtemény",,,,egyetem_napja_2002_web_019,"A kép a Szegedi Tudományegyetem Klebelsberg Kuno Könyvtárának tulajdonát képezi. Minden jog fenntartva.","Szegedi Tudományegyetem Klebelsberg Kuno Könyvtára",,,,,,,,,,,,,,,,,,,,,,,,,,,,,,,,,,,,,,,,,,,,,,,,,,,,,,,,,,,,,,,,,,,"Csákány Béla,Mádl Ferenc,Mészáros Rezső,Rektori Hivatal",http://digit.bibl.u-szeged.hu/00400/00499/omeka/unnepseg/egyetem_napja/egyetem_napja_2002_web_019.jpg,"Still Image","<strong>Egyetemi képgyűjtemény</strong>",1,0