﻿"Item Id","Item URI","Dublin Core:Title","Dublin Core:Alternative Title","Dublin Core:Description","Dublin Core:Creator","Dublin Core:Contributor","Dublin Core:Spatial Coverage","Dublin Core:Temporal Coverage","Dublin Core:Coverage","Dublin Core:Date","Dublin Core:Date Created","Dublin Core:Language","Dublin Core:Type","Dublin Core:Format","Dublin Core:Medium","Dublin Core:Extent","Dublin Core:Source","Dublin Core:Subject","Dublin Core:Is Part Of","Dublin Core:Relation","Dublin Core:Publisher","Dublin Core:Bibliographic Citation","Dublin Core:Identifier","Dublin Core:Rights","Dublin Core:Rights Holder","Dublin Core:Abstract","Dublin Core:Table Of Contents","Dublin Core:Date Available","Dublin Core:Date Accepted","Dublin Core:Date Copyrighted","Dublin Core:Date Submitted","Dublin Core:Date Issued","Dublin Core:Date Modified","Dublin Core:Date Valid","Dublin Core:Access Rights","Dublin Core:License","Dublin Core:Conforms To","Dublin Core:Has Format","Dublin Core:Has Part","Dublin Core:Has Version","Dublin Core:Is Format Of","Dublin Core:Is Referenced By","Dublin Core:Is Replaced By","Dublin Core:Is Required By","Dublin Core:Is Version Of","Dublin Core:References","Dublin Core:Replaces","Dublin Core:Requires","Dublin Core:Accrual Method","Dublin Core:Accrual Periodicity","Dublin Core:Accrual Policy","Dublin Core:Audience","Dublin Core:Audience Education Level","Dublin Core:Mediator","Dublin Core:Instructional Method","Dublin Core:Provenance","Item Type Metadata:Text","Item Type Metadata:Interviewer","Item Type Metadata:Interviewee","Item Type Metadata:Location","Item Type Metadata:Transcription","Item Type Metadata:Local URL","Item Type Metadata:Original Format","Item Type Metadata:Physical Dimensions","Item Type Metadata:Duration","Item Type Metadata:Compression","Item Type Metadata:Producer","Item Type Metadata:Director","Item Type Metadata:Bit Rate/Frequency","Item Type Metadata:Time Summary","Item Type Metadata:Email Body","Item Type Metadata:Subject Line","Item Type Metadata:From","Item Type Metadata:To","Item Type Metadata:CC","Item Type Metadata:BCC","Item Type Metadata:Number of Attachments","Item Type Metadata:Standards","Item Type Metadata:Objectives","Item Type Metadata:Materials","Item Type Metadata:Lesson Plan Text","Item Type Metadata:URL","Item Type Metadata:Event Type","Item Type Metadata:Participants","Item Type Metadata:Birth Date","Item Type Metadata:Birthplace","Item Type Metadata:Death Date","Item Type Metadata:Occupation","Item Type Metadata:Biographical Text","Item Type Metadata:Bibliography","PDF Text:Text",tags,file,itemType,collection,public,featured
21763,https://mediateka.ek.szte.hu/items/show/21763,"Vetró Gábor SZOTE KISZ-titkár köszönti a jubiláló egyetemek vezetőit, tanárait","A szegedi egyetemi felsőoktatás megindulásának 50. évfordulója alkalmából rendezett ünnepségsorozat",,,,Szeged,,,,"1971. október 9-11.",,,fekete-fehér,fénykép,"6,5x9,5 cm",,"Vetró Gábor SZOTE KISZ-titkár; Tóth Károly a SZOTE rektora; Márta Ferenc a JATE rektora; Kedvessy György dékán; Antalffy György dékán","Egyetemi Képgyűjtemény (A szegedi egyetemek 50. jubileumi albuma)",,,"p. 2.",szte_50_jubileum_web_004_014,"A kép a Szegedi Tudományegyetem Klebelsberg Kuno Könyvtárának tulajdonát képezi. Minden jog fenntartva.","Szegedi Tudományegyetem Klebelsberg Kuno Könyvtára",,,,,,,,,,,,,,,,,,,,,,,,,,,,,,,,,,,,,,,,,,,,,,,,,,,,,,,,,,,,,,,,,,,"Antalffy György,Kedvessy György,Márta Ferenc,Tóth Károly,Vetró Gábor","http://digit.bibl.u-szeged.hu/00400/00499/omeka/szte_50eves_jubileumi_album/szte_50_jubileum_web_004_014.jpg,https://mediateka.ek.szte.hu/files/original/dcc63c9c3193bf64c5b537108de0edd9.jpg","Still Image","Szegedi egyetemek 50. jubileuma",1,0
18005,https://mediateka.ek.szte.hu/items/show/18005,"Veres József a dékán",,,,,,,,,1979,,,fekete-fehér,fénykép,"9x12 cm",,"Veres József dékán; Antalffy György rektor","Egyetemi Képgyűjtemény",,,,sztegy-568,"A kép a Szegedi Tudományegyetem Klebelsberg Kuno Könyvtárának tulajdonát képezi. Minden jog fenntartva.","Szegedi Tudományegyetem Klebelsberg Kuno Könyvtára",,,,,,,,,,,,,,,,,,,,,,,,,,,,,,,,,,,,,,,,,,,,,,,,,,,,,,,,,,,,,,,,,,,"Antalffy György,Rektori Hivatal,Veres József",http://digit.bibl.u-szeged.hu/sztegy/photo/568.jpg,"Still Image","<strong>Egyetemi képgyűjtemény</strong>",1,0
24234,https://mediateka.ek.szte.hu/items/show/24234,"Vendégek fogadása a Rektori Hivatal dísztermében doktoravatás után",,,,,Szeged,,,,"1982. február 12.",,,színes,fénykép,"10x15 cm",,"Rektori Hivatal; Antalffy György rektor; Korom Mihály az MSZMP PB tagja","Egyetemi Képgyűjtemény",,,,avatas_web_078,"A kép a Szegedi Tudományegyetem Klebelsberg Kuno Könyvtárának tulajdonát képezi. Minden jog fenntartva.","Szegedi Tudományegyetem Klebelsberg Kuno Könyvtára",,,,,,,,,,,,,,,,,,,,,,,,,,,,,,,,,,,,,,,,,,,,,,,,,,,,,,,,,,,,,,,,,,,"Antalffy György,Korom Mihály,Rektori Hivatal",http://digit.bibl.u-szeged.hu/00400/00499/omeka/avatas/avatas_web_078.jpg,"Still Image","<strong>Egyetemi képgyűjtemény</strong>",1,0
17563,https://mediateka.ek.szte.hu/items/show/17563,"Vendégek az egyetemen",,,"Liebmann Béla",,,,,,"1960-as évek",,,fekete-fehér,fénykép,"9x14 cm",,"Antalffy György rektor; Ilku Pál művelődésügyi miniszter; Győri Imre, az MSZMP KB tagja; Perjési László MSZMP Szegedi VB titkár","Egyetemi Képgyűjtemény",,,,sztegy-122,"A kép a Szegedi Tudományegyetem Klebelsberg Kuno Könyvtárának tulajdonát képezi. Minden jog fenntartva.","Szegedi Tudományegyetem Klebelsberg Kuno Könyvtára",,,,,,,,,,,,,,,,,,,,,,,,,,,,,,,,,,,,,,,,,,,,,,,,,,,,,,,,,,,,,,,,,,,"Antalffy György,Győri Imre,Ilku Pál,Perjési László,Rektori Hivatal",http://digit.bibl.u-szeged.hu/sztegy/photo/122.jpg,"Still Image","<strong>Egyetemi képgyűjtemény</strong>",1,0
17539,https://mediateka.ek.szte.hu/items/show/17539,"Vendégek az egyetemen",,,"Liebmann Béla",,Szeged,,,,"1964. április 14.",,,fekete-fehér,fénykép,"9x14 cm",,"Dobi István, az Elnöki Tanács elnöke; Antalffy György rektor; Siklós János újságíró","Egyetemi Képgyűjtemény",,,,sztegy-098,"A kép a Szegedi Tudományegyetem Klebelsberg Kuno Könyvtárának tulajdonát képezi. Minden jog fenntartva.","Szegedi Tudományegyetem Klebelsberg Kuno Könyvtára",,,,,,,,,,,,,,,,,,,,,,,,,,,,,,,,,,,,,,,,,,,,,,,,,,,,,,,,,,,,,,,,,,,"Antalffy György,Dobi István,Rektori Hivatal,Siklós János",http://digit.bibl.u-szeged.hu/sztegy/photo/098.jpg,"Still Image","<strong>Egyetemi képgyűjtemény</strong>",1,0
17497,https://mediateka.ek.szte.hu/items/show/17497,"Vendégek az egyetemen",,,"Liebmann Béla",,Szeged,,,,"1964. április 14.",,,fekete-fehér,fénykép,"9x13 cm",,"Dobi István, az Elnöki Tanács elnöke; Antalffy György rektor; Kisházi Ödön, az Elnöki Tanács helyettes elnöke","Egyetemi Képgyűjtemény",,,,sztegy-061,"A kép a Szegedi Tudományegyetem Klebelsberg Kuno Könyvtárának tulajdonát képezi. Minden jog fenntartva.","Szegedi Tudományegyetem Klebelsberg Kuno Könyvtára",,,,,,,,,,,,,,,,,,,,,,,,,,,,,,,,,,,,,,,,,,,,,,,,,,,,,,,,,,,,,,,,,,,"Antalffy György,Dobi István,Kisházi Ödön,Rektori Hivatal",http://digit.bibl.u-szeged.hu/sztegy/photo/061.jpg,"Still Image","<strong>Egyetemi képgyűjtemény</strong>",1,0
18563,https://mediateka.ek.szte.hu/items/show/18563,"Vendég fogadása az egyetemen",,,"Liebmann Béla",,,,Szeged,,"1964. április 14.",,,fekete-fehér,fénykép,"9x14 cm",,"Várkonyi Zoltán; Antalffy György rektor; Márta Ferenc; Dobi István, az Elnöki Tanács elnöke","Egyetemi Képgyűjtemény",,,,sztegy-097,"A kép a Szegedi Tudományegyetem Klebelsberg Kuno Könyvtárának tulajdonát képezi. Minden jog fenntartva.","Szegedi Tudományegyetem Klebelsberg Kuno Könyvtára",,,,,,,,,,,,,,,,,,,,,,,,,,,,,,,,,,,,,,,,,,,,,,,,,,,,,,,,,,,,,,,,,,,"Antalffy György,Dobi István,Márta Ferenc,Rektori Hivatal,Várkonyi Zoltán",http://digit.bibl.u-szeged.hu/sztegy/photo/097.jpg,"Still Image","<strong>Egyetemi képgyűjtemény</strong>",1,0
17579,https://mediateka.ek.szte.hu/items/show/17579,"Vendég fogadása az Egyetemen",,,"Liebmann Béla",,Szeged,,,,"1964. április 14.",,,fekete-fehér,fénykép,"9x14 cm",,"Ketskeméty István dékánhelyettes; Antalffy György rektor; Dobi István, az Elnöki Tanács elnöke","Egyetemi Képgyűjtemény",,,,sztegy-138,"A kép a Szegedi Tudományegyetem Klebelsberg Kuno Könyvtárának tulajdonát képezi. Minden jog fenntartva.","Szegedi Tudományegyetem Klebelsberg Kuno Könyvtára",,,,,,,,,,,,,,,,,,,,,,,,,,,,,,,,,,,,,,,,,,,,,,,,,,,,,,,,,,,,,,,,,,,"Antalffy György,Dobi István,Ketskeméty István,Rektori Hivatal",http://digit.bibl.u-szeged.hu/sztegy/photo/138.jpg,"Still Image","<strong>Egyetemi képgyűjtemény</strong>",1,0
17536,https://mediateka.ek.szte.hu/items/show/17536,"Vendég fogadása az egyetemen",,,"Liebmann Béla",,Szeged,,,,"1964. április 14.",,,fekete-fehér,fénykép,"9x14 cm",,"Ketskeméty István dékánhelyettes; Antalffy György rektor; Dobi István, az Elnöki Tanács elnöke","Egyetemi Képgyűjtemény",,,,sztegy-095,"A kép a Szegedi Tudományegyetem Klebelsberg Kuno Könyvtárának tulajdonát képezi. Minden jog fenntartva.","Szegedi Tudományegyetem Klebelsberg Kuno Könyvtára",,,,,,,,,,,,,,,,,,,,,,,,,,,,,,,,,,,,,,,,,,,,,,,,,,,,,,,,,,,,,,,,,,,"Antalffy György,Dobi István,Ketskeméty István,Rektori Hivatal",http://digit.bibl.u-szeged.hu/sztegy/photo/095.jpg,"Still Image","<strong>Egyetemi képgyűjtemény</strong>",1,0
18579,https://mediateka.ek.szte.hu/items/show/18579,"Vendég fogadása a Rektori Hivatalban",,,,,,,,,"1960-as évek vége",,,fekete-fehér,fénykép,"13x18 cm",,"Szalay László rektorhelyettes; Márta Ferenc rektor; Antalffy György dékán","Egyetemi Képgyűjtemény",,,,sztegy-5036,"A kép a Szegedi Tudományegyetem Klebelsberg Kuno Könyvtárának tulajdonát képezi. Minden jog fenntartva.","Szegedi Tudományegyetem Klebelsberg Kuno Könyvtára",,,,,,,,,,,,,,,,,,,,,,,,,,,,,,,,,,,,,,,,,,,,,,,,,,,,,,,,,,,,,,,,,,,"Antalffy György,Márta Ferenc,Rektori Hivatal,Szalay László",http://digit.bibl.u-szeged.hu/sztegy/photo/5036.jpg,"Still Image","<strong>Egyetemi képgyűjtemény</strong>",1,0
17558,https://mediateka.ek.szte.hu/items/show/17558,"Vendég az egyetemen",,,"Liebmann Béla",,,,,,1961,,,fekete-fehér,fénykép,"9x14 cm",,"Komócsin Mihály, Politikai Bizottság póttagja; Antalffy György rektor; Kádár János Minisztertanács elnöke; Petri Gábor rektor; Szirmai István, a Központi Bizottság titkára","Egyetemi Képgyűjtemény",,,,sztegy-117,"A kép a Szegedi Tudományegyetem Klebelsberg Kuno Könyvtárának tulajdonát képezi. Minden jog fenntartva.","Szegedi Tudományegyetem Klebelsberg Kuno Könyvtára",,,,,,,,,,,,,,,,,,,,,,,,,,,,,,,,,,,,,,,,,,,,,,,,,,,,,,,,,,,,,,,,,,,"Antalffy György,Kádár János,Komócsin Mihály,Petri Gábor,Rektori Hivatal,Szirmai István",http://digit.bibl.u-szeged.hu/sztegy/photo/117.jpg,"Still Image","<strong>Egyetemi képgyűjtemény</strong>",1,0
17557,https://mediateka.ek.szte.hu/items/show/17557,"Vendég az egyetemen",,,"Liebmann Béla",,,,,,1961,,,fekete-fehér,fénykép,"9x14 cm",,"Ivánovics György; Antalffy György; Kádár János Minisztertanács elnöke; Petri Gábor","Egyetemi Képgyűjtemény",,,,sztegy-116,"A kép a Szegedi Tudományegyetem Klebelsberg Kuno Könyvtárának tulajdonát képezi. Minden jog fenntartva.","Szegedi Tudományegyetem Klebelsberg Kuno Könyvtára",,,,,,,,,,,,,,,,,,,,,,,,,,,,,,,,,,,,,,,,,,,,,,,,,,,,,,,,,,,,,,,,,,,"Antalffy György,Ivanovics György,Kádár János,Petri Gábor,Rektori Hivatal",http://digit.bibl.u-szeged.hu/sztegy/photo/116.jpg,"Still Image","<strong>Egyetemi képgyűjtemény</strong>",1,0
24233,https://mediateka.ek.szte.hu/items/show/24233,"Ünnepi doktoravató szenátusülés a József Attila Tudományegyetemen",,,,,Szeged,,,,"1982. február 12.",,,színes,fénykép,"10x15 cm",,"Rektori Hivatal; Veres József dékán; Antalffy György dékán; Serfőző Lajos dékán; Bartók Mihály dékán","Egyetemi Képgyűjtemény",,,,avatas_web_065,"A kép a Szegedi Tudományegyetem Klebelsberg Kuno Könyvtárának tulajdonát képezi. Minden jog fenntartva.","Szegedi Tudományegyetem Klebelsberg Kuno Könyvtára",,,,,,,,,,,,,,,,,,,,,,,,,,,,,,,,,,,,,,,,,,,,,,,,,,,,,,,,,,,,,,,,,,,"Antalffy György,Bartók Mihály,Rektori Hivatal,Serfőző Lajos,Veres József",http://digit.bibl.u-szeged.hu/00400/00499/omeka/avatas/avatas_web_065.jpg,"Still Image","<strong>Egyetemi képgyűjtemény</strong>",1,0
24869,https://mediateka.ek.szte.hu/items/show/24869,"Ünnepi doktoravató közgyűlés a József Attila Tudományegyetemen",,,,,Szeged,,,,1976,,,fekete-fehér,fénykép,"9x14 cm",,"Kovács István dékán; Antalffy György rektor; Csukás István dékán; Tandori Károly dékán","Egyetemi Képgyűjtemény",,,,szte_001_109_web,"A kép a Szegedi Tudományegyetem Klebelsberg Kuno Könyvtárának tulajdonát képezi. Minden jog fenntartva.","Szegedi Tudományegyetem Klebelsberg Kuno Könyvtára",,,,,,,,,,,,,,,,,,,,,,,,,,,,,,,,,,,,,,,,,,,,,,,,,,,,,,,,,,,,,,,,,,,"Antalffy György,Csukás István,Kovács István - jogász,Tandori Károly",http://digit.bibl.u-szeged.hu/00400/00499/omeka/egyetem_vegyes/szte_001/szte_001_109_web.jpg,"Still Image","<strong>Egyetemi képgyűjtemény</strong>",1,0
22174,https://mediateka.ek.szte.hu/items/show/22174,"Tóth Károly az Orvostudományi Egyetem rektora megköszöni az üdvözleteket","A szegedi egyetemi felsőoktatás megindulásának 50. évfordulója alkalmából rendezett ünnepségsorozat",,,,Szeged,,,,"1971. október 9-11.",,,fekete-fehér,fénykép,"6,5x9,5 cm",,"Ilku Pál művelődésügyi miniszter; Tóth Károly a SZOTE rektora; Kalocsai Dezső dékán; Szabó Zoltán egészségügyi miniszter; Antalffy György dékán","Egyetemi Képgyűjtemény (A szegedi egyetemek 50. jubileumi albuma)",,,"p. 44.",szte_50_jubileum_web_046_383,"A kép a Szegedi Tudományegyetem Klebelsberg Kuno Könyvtárának tulajdonát képezi. Minden jog fenntartva.","Szegedi Tudományegyetem Klebelsberg Kuno Könyvtára",,,,,,,,,,,,,,,,,,,,,,,,,,,,,,,,,,,,,,,,,,,,,,,,,,,,,,,,,,,,,,,,,,,"Antalffy György,Ilku Pál,Kalocsai Dezső,Tóth Károly",http://digit.bibl.u-szeged.hu/00400/00499/omeka/szte_50eves_jubileumi_album/szte_50_jubileum_web_046_383.jpg,"Still Image","Szegedi egyetemek 50. jubileuma",1,0
22173,https://mediateka.ek.szte.hu/items/show/22173,"Tóth Károly az Orvostudományi Egyetem rektora megköszöni az üdvözleteket","A szegedi egyetemi felsőoktatás megindulásának 50. évfordulója alkalmából rendezett ünnepségsorozat",,,,Szeged,,,,"1971. október 9-11.",,,fekete-fehér,fénykép,"6,5x9,5 cm",,"Ilku Pál művelődésügyi miniszter; Tóth Károly a SZOTE rektora; Kalocsai Dezső dékán; Szabó Zoltán egészségügyi miniszter; Antalffy György dékán","Egyetemi Képgyűjtemény (A szegedi egyetemek 50. jubileumi albuma)",,,"p. 44.",szte_50_jubileum_web_046_382,"A kép a Szegedi Tudományegyetem Klebelsberg Kuno Könyvtárának tulajdonát képezi. Minden jog fenntartva.","Szegedi Tudományegyetem Klebelsberg Kuno Könyvtára",,,,,,,,,,,,,,,,,,,,,,,,,,,,,,,,,,,,,,,,,,,,,,,,,,,,,,,,,,,,,,,,,,,"Antalffy György,Ilku Pál,Kalocsai Dezső,Tóth Károly",http://digit.bibl.u-szeged.hu/00400/00499/omeka/szte_50eves_jubileumi_album/szte_50_jubileum_web_046_382.jpg,"Still Image","Szegedi egyetemek 50. jubileuma",1,0
18611,https://mediateka.ek.szte.hu/items/show/18611,"Tanévnyitó ünnepség elnöksége",,,"Liebmann Béla",,,,,,1958,,,fekete-fehér,fénykép,"12x18 cm",,"Nyíri Antal rektorhelyettes; Gulya Károly MSZMP VB titkár; Antalffy György dékán; Greguss Pál rektor; Székely Lajos rektorhelyettes; Halász Előd dékán; Budó Ágoston dékán; Maday Pál; Miháltz István; Szigeti József művelődésügyi miniszterhelyettes","Egyetemi Képgyűjtemény",,,,sztegy-5080,"A kép a Szegedi Tudományegyetem Klebelsberg Kuno Könyvtárának tulajdonát képezi. Minden jog fenntartva.","Szegedi Tudományegyetem Klebelsberg Kuno Könyvtára",,,,,,,,,,,,,,,,,,,,,,,,,,,,,,,,,,,,,,,,,,,,,,,,,,,,,,,,,,,,,,,,,,,"Antalffy György,Budó Ágoston,Greguss Pál,Gulya Károly,Halász Előd,Maday Pál,Miháltz István,Nyíri Antal,Rektori Hivatal,Székely Lajos,Szigeti József",http://digit.bibl.u-szeged.hu/sztegy/photo/5080.jpg,"Still Image","<strong>Egyetemi képgyűjtemény</strong>",1,0
18269,https://mediateka.ek.szte.hu/items/show/18269,"Tanévnyitó ünnepség elnöksége",,"5 kép van","Liebmann Béla",,,,,,1958,,,fekete-fehér,fénykép,"13x18 cm",,"Nyíri Antal rektorhelyettes; Gulya Károly MSZMP VB titkár; Antalffy György dékán; Greguss Pál rektor; Székely Lajos rektorhelyettes; Halász Előd dékán; Budó Ágoston dékán; Szigeti József művelődésügyi miniszterhelyettes","Egyetemi Képgyűjtemény",,,,sztegy-5078,"A kép a Szegedi Tudományegyetem Klebelsberg Kuno Könyvtárának tulajdonát képezi. Minden jog fenntartva.","Szegedi Tudományegyetem Klebelsberg Kuno Könyvtára",,,,,,,,,,,,,,,,,,,,,,,,,,,,,,,,,,,,,,,,,,,,,,,,,,,,,,,,,,,,,,,,,,,"Antalffy György,Budó Ágoston,Greguss Pál,Gulya Károly,Halász Előd,Nyíri Antal,Rektori Hivatal,Székely Lajos,Szigeti József",http://digit.bibl.u-szeged.hu/sztegy/photo/5078.jpg,"Still Image","<strong>Egyetemi képgyűjtemény</strong>",1,0
18267,https://mediateka.ek.szte.hu/items/show/18267,"Tanévnyitó ünnepség elnöksége",,,"Liebmann Béla",,,,,,1958,,,fekete-fehér,fénykép,"13x18 cm",,"Antalffy György dékán; Greguss Pál rektor; Székely Lajos rektorhelyettes; Halász Előd dékán; Budó Ágoston dékán; Koch Sándor; Kiss Árpád","Egyetemi Képgyűjtemény",,,,sztegy-5081,"A kép a Szegedi Tudományegyetem Klebelsberg Kuno Könyvtárának tulajdonát képezi. Minden jog fenntartva.","Szegedi Tudományegyetem Klebelsberg Kuno Könyvtára",,,,,,,,,,,,,,,,,,,,,,,,,,,,,,,,,,,,,,,,,,,,,,,,,,,,,,,,,,,,,,,,,,,"Antalffy György,Budó Ágoston,Greguss Pál,Halász Előd,Kiss Árpád,Koch Sándor,Rektori Hivatal,Székely Lajos",http://digit.bibl.u-szeged.hu/sztegy/photo/5081.jpg,"Still Image","<strong>Egyetemi képgyűjtemény</strong>",1,0
18268,https://mediateka.ek.szte.hu/items/show/18268,"Tanévnyitó ünnepség az egyetemen",,,"Liebmann Béla",,,,,,1958,,,fekete-fehér,fénykép,"13x18 cm",,"Antalffy György dékán; Szigeti József művelődésügyi miniszterhelyettes; Greguss Pál rektor; Székely Lajos rektorhelyettes","Egyetemi Képgyűjtemény",,,,sztegy-5082,"A kép a Szegedi Tudományegyetem Klebelsberg Kuno Könyvtárának tulajdonát képezi. Minden jog fenntartva.","Szegedi Tudományegyetem Klebelsberg Kuno Könyvtára",,,,,,,,,,,,,,,,,,,,,,,,,,,,,,,,,,,,,,,,,,,,,,,,,,,,,,,,,,,,,,,,,,,"Antalffy György,Greguss Pál,Rektori Hivatal,Székely Lajos,Szigeti József",http://digit.bibl.u-szeged.hu/sztegy/photo/5082.jpg,"Still Image","<strong>Egyetemi képgyűjtemény</strong>",1,0
18250,https://mediateka.ek.szte.hu/items/show/18250,"Tanévnyitó ünnepség az egyetemen",,,"Liebmann Béla",,,,,,"1958/59. tanév",,,fekete-fehér,fénykép,"18x24 cm",,"Miháltz István; Budó Ágoston dékán; Maday Pál; Halász Előd dékán; Székely Lajos rektorhelyettes; Greguss Pál; Antalffy György rektor; Gulya Károly MSZMP VB titkár; Szigeti József művelődésügyi miniszterhelyettes","Egyetemi Képgyűjtemény",,,,sztegy-5398,"A kép a Szegedi Tudományegyetem Klebelsberg Kuno Könyvtárának tulajdonát képezi. Minden jog fenntartva.","Szegedi Tudományegyetem Klebelsberg Kuno Könyvtára",,,,,,,,,,,,,,,,,,,,,,,,,,,,,,,,,,,,,,,,,,,,,,,,,,,,,,,,,,,,,,,,,,,"Antalffy György,Budó Ágoston,Greguss Pál,Gulya Károly,Halász Előd,Maday Pál,Miháltz István,Rektori Hivatal,Székely Lajos,Szigeti József",http://digit.bibl.u-szeged.hu/sztegy/photo/5398.jpg,"Still Image","<strong>Egyetemi képgyűjtemény</strong>",1,0
17951,https://mediateka.ek.szte.hu/items/show/17951,"Tanévnyitó ünnepség az egyetemen",,"3 kép van",,,,,,,"1976. szeptember 14.",,,fekete-fehér,fénykép,13x18,,"Krajkó András; Kovács István dékán; Antalffy György rektor; Csukás István dékán; Tandori Károly dékán; Papp István KISZ titkár","Egyetemi Képgyűjtemény",,,,sztegy-5151,"A kép a Szegedi Tudományegyetem Klebelsberg Kuno Könyvtárának tulajdonát képezi. Minden jog fenntartva.","Szegedi Tudományegyetem Klebelsberg Kuno Könyvtára",,,,,,,,,,,,,,,,,,,,,,,,,,,,,,,,,,,,,,,,,,,,,,,,,,,,,,,,,,,,,,,,,,,"Antalffy György,Csukás István,Kovács István - jogász,Krajkó András,Papp István,Rektori Hivatal,Tandori Károly",http://digit.bibl.u-szeged.hu/sztegy/photo/5151.jpg,"Still Image","<strong>Egyetemi képgyűjtemény</strong>",1,0
25072,https://mediateka.ek.szte.hu/items/show/25072,"Tanévnyitó ünnepség a József Attila Tudományegyetemen",,,,,Szeged,,,,"1978. szeptember 12.",,,fekete-fehér,fénykép,"9x14 cm",,"Kardos Jó­zsef Oktatási Minisz­térium főosztályvezetője; Antalffy György rektor; Csukás István dékán","Egyetemi Képgyűjtemény",,,,szte_027_013_web,"A kép a Szegedi Tudományegyetem Klebelsberg Kuno Könyvtárának tulajdonát képezi. Minden jog fenntartva.","Szegedi Tudományegyetem Klebelsberg Kuno Könyvtára",,,,,,,,,,,,,,,,,,,,,,,,,,,,,,,,,,,,,,,,,,,,,,,,,,,,,,,,,,,,,,,,,,,"Antalffy György,Csukás István,Kardos Jó­zsef,Rektori Hivatal",https://mediateka.ek.szte.hu/files/original/11b53d2612a2e74d56b1455248880d33.jpg,"Still Image","<strong>Egyetemi képgyűjtemény</strong>",1,0
25070,https://mediateka.ek.szte.hu/items/show/25070,"Tanévnyitó ünnepség a József Attila Tudományegyetemen",,,,,Szeged,,,,"1978. szeptember 12.",,,fekete-fehér,fénykép,"9x14 cm",,"Székely Sándor MSZMP titkár; Kovács István dékán; Kardos Jó­zsef Oktatási Minisz­térium főosztályvezetője; Antalffy György rektor; Csukás István dékán; Tandori Károly dékán; Csernus Sándor KISZ titkár","Egyetemi Képgyűjtemény",,,,szte_027_017_web,"A kép a Szegedi Tudományegyetem Klebelsberg Kuno Könyvtárának tulajdonát képezi. Minden jog fenntartva.","Szegedi Tudományegyetem Klebelsberg Kuno Könyvtára",,,,,,,,,,,,,,,,,,,,,,,,,,,,,,,,,,,,,,,,,,,,,,,,,,,,,,,,,,,,,,,,,,,"Antalffy György,Csernus Sándor,Csukás István,Kardos Jó­zsef,Kovács István - jogász,Székely Sándor,Tandori Károly","https://mediateka.ek.szte.hu/files/original/b993ed179d06437c644db81af6d19ebb.jpg,https://mediateka.ek.szte.hu/files/original/aea8ac672bf43744e19ccd0088716a74.jpg,https://mediateka.ek.szte.hu/files/original/618acd4ac7ac0fb67eec6f1f9d6902de.jpg","Still Image","<strong>Egyetemi képgyűjtemény</strong>",1,0
25069,https://mediateka.ek.szte.hu/items/show/25069,"Tanévnyitó ünnepség a József Attila Tudományegyetemen",,,,,Szeged,,,,"1978. szeptember 12.",,,fekete-fehér,fénykép,"9x14 cm",,"Kovács István dékán; Kardos Jó­zsef Oktatási Minisz­térium főosztályvezetője; Antalffy György rektor; Csukás István dékán; Tandori Károly dékán","Egyetemi Képgyűjtemény",,,,szte_027_010_web,"A kép a Szegedi Tudományegyetem Klebelsberg Kuno Könyvtárának tulajdonát képezi. Minden jog fenntartva.","Szegedi Tudományegyetem Klebelsberg Kuno Könyvtára",,,,,,,,,,,,,,,,,,,,,,,,,,,,,,,,,,,,,,,,,,,,,,,,,,,,,,,,,,,,,,,,,,,"Antalffy György,Csukás István,Kardos Jó­zsef,Kovács István - jogász,Rektori Hivatal,Tandori Károly","https://mediateka.ek.szte.hu/files/original/d085fe9a7afa3fe01e02d18c4cfba898.jpg,https://mediateka.ek.szte.hu/files/original/f1d484bd90231bd2751a64d15a0d2d39.jpg,https://mediateka.ek.szte.hu/files/original/8ca95a75130321db75e0ec6d0fba73cb.jpg,https://mediateka.ek.szte.hu/files/original/61e8a2cfca8d8a4288cc21f58b0d4a1f.jpg,https://mediateka.ek.szte.hu/files/original/986432fd7df7c2422484ff56cb1b3323.jpg,https://mediateka.ek.szte.hu/files/original/0cef8836fbf8562ae7b02d5bc607ffce.jpg","Still Image","<strong>Egyetemi képgyűjtemény</strong>",1,0
18528,https://mediateka.ek.szte.hu/items/show/18528,"Tanévnyitó az egyetemen",,,,,,,,,1969,,,fekete-fehér,fénykép,"13x18 cm",,"Antalffy György dékán; Papp Ignác; Márta Ferenc rektor; Katona Péter; Szalay László dékán","Egyetemi Képgyűjtemény",,,,sztegy-5110,"A kép a Szegedi Tudományegyetem Klebelsberg Kuno Könyvtárának tulajdonát képezi. Minden jog fenntartva.","Szegedi Tudományegyetem Klebelsberg Kuno Könyvtára",,,,,,,,,,,,,,,,,,,,,,,,,,,,,,,,,,,,,,,,,,,,,,,,,,,,,,,,,,,,,,,,,,,"Antalffy György,Katona Péter,Márta Ferenc,Papp Ignác,Rektori Hivatal,Szalay László",http://digit.bibl.u-szeged.hu/sztegy/photo/5110.jpg,"Still Image","<strong>Egyetemi képgyűjtemény</strong>",1,0